Target
Alpha-1D adrenergic receptor
Ligand
BDBM50071659
Substrate
Meas. Tech.
ChEBML_33019
Ki
894.0±n/a nM
Citation
 Nerenberg, JBErb, JMThompson, WJLee, HYGuare, JPMunson, PMBergman, JMHuff, JRBroten, TPChang, RSChen, TBO'Malley, SSchorn, TWScott, AL Design and synthesis of N-alkylated saccharins as selective alpha-1a adrenergic receptor antagonists. Bioorg Med Chem Lett 8:2467-72 (1999)  
Target
Name:
Alpha-1D adrenergic receptor
Synonyms:
ADA1D_HUMAN ADRA1D Adrenergic receptor alpha Alpha 1D-adrenoreceptor Alpha-1D adrenoceptor adrenergic Alpha1D
Type:
Enzyme Catalytic Domain
Mol. Mass.:
60485.82
Organism:
Homo sapiens (Human)
Description:
adrenergic Alpha1D ADRA1D HUMAN::P25100
Residue:
572
  
Inhibitor
Name:
BDBM50071659
Synonyms:
3-{1-[4-(1,1,3-Trioxo-1,3-dihydro-1lambda*6*-benzo[d]isothiazol-2-yl)-butyl]-piperidin-4-yl}-5,6,7,8-tetrahydro-3H-naphtho[2,3-d]oxazol-2-one | CHEMBL309949
Type:
Small organic molecule
Emp. Form.:
C27H31N3O5S
Mol. Mass.:
509.617
SMILES:
O=C1N(CCCCN2CCC(CC2)n2c3cc4CCCCc4cc3oc2=O)S(=O)(=O)c2ccccc12
: