Target
Alpha-1B adrenergic receptor
Ligand
BDBM50071659
Substrate
Meas. Tech.
ChEBML_32895
Ki
676±n/a nM
Citation
 Nerenberg, JBErb, JMThompson, WJLee, HYGuare, JPMunson, PMBergman, JMHuff, JRBroten, TPChang, RSChen, TBO'Malley, SSchorn, TWScott, AL Design and synthesis of N-alkylated saccharins as selective alpha-1a adrenergic receptor antagonists. Bioorg Med Chem Lett 8:2467-72 (1999)  
Target
Name:
Alpha-1B adrenergic receptor
Synonyms:
ADA1B_HUMAN Adrenergic alpha1B Adrenergic receptor alpha Alpha 1B-adrenoreceptor | Alpha-1B adrenergic receptor
Type:
Enzyme
Mol. Mass.:
56862.13
Organism:
Homo sapiens (Human)
Description:
P35368
Residue:
520
  
Inhibitor
Name:
BDBM50071659
Synonyms:
3-{1-[4-(1,1,3-Trioxo-1,3-dihydro-1lambda*6*-benzo[d]isothiazol-2-yl)-butyl]-piperidin-4-yl}-5,6,7,8-tetrahydro-3H-naphtho[2,3-d]oxazol-2-one | CHEMBL309949
Type:
Small organic molecule
Emp. Form.:
C27H31N3O5S
Mol. Mass.:
509.617
SMILES:
O=C1N(CCCCN2CCC(CC2)n2c3cc4CCCCc4cc3oc2=O)S(=O)(=O)c2ccccc12
: