Target
Histone deacetylase 7
Ligand
BDBM50517218
Substrate
Meas. Tech.
ChEMBL_1867762 (CHEMBL4368737)
Ki
39±n/a nM
Citation
 Asfaha, YSchrenk, CAlves Avelar, LAHamacher, APflieger, MKassack, MUKurz, T Recent advances in class IIa histone deacetylases research. Bioorg Med Chem 27:0 (2019)  
Target
Name:
Histone deacetylase 7
Synonyms:
HD7 HDAC7A Histone acetylase 7 (HDAC7) Human HDAC7
Type:
Chromatin regulator; hydrolase; repressor
Mol. Mass.:
102942.62
Organism:
Homo sapiens (Human)
Description:
Q8WUI4
Residue:
952
  
Inhibitor
Name:
BDBM50517218
Synonyms:
CHEMBL4525406
Type:
Small organic molecule
Emp. Form.:
C26H24F3N5O2S
Mol. Mass.:
527.561
SMILES:
CN1CCC(CNC(=O)c2cccc(c2)-c2noc(n2)C(F)(F)F)(CC1)c1nc(cs1)-c1ccccc1
: