Target
Histone deacetylase 11
Ligand
BDBM50517219
Substrate
Meas. Tech.
ChEMBL_1867770 (CHEMBL4368745)
Ki
>19000±n/a nM
Citation
 Asfaha, YSchrenk, CAlves Avelar, LAHamacher, APflieger, MKassack, MUKurz, T Recent advances in class IIa histone deacetylases research. Bioorg Med Chem 27:0 (2019)  
Target
Name:
Histone deacetylase 11
Synonyms:
HD11 HDAC11 | Human HDAC11
Type:
Chromatin regulator; hydrolase; repressor
Mol. Mass.:
39187.66
Organism:
Homo sapiens (Human)
Description:
Q96DB2
Residue:
347
  
Inhibitor
Name:
BDBM50517219
Synonyms:
CHEMBL4456269
Type:
Small organic molecule
Emp. Form.:
C24H26N4O3S
Mol. Mass.:
450.553
SMILES:
CN1CCC(CNC(=O)c2cccc(c2)C(=O)NO)(CC1)c1nc(cs1)-c1ccccc1
: