Target
Growth hormone secretagogue receptor type 1
Ligand
BDBM50517279
Substrate
Meas. Tech.
ChEMBL_1868767 (CHEMBL4369833)
Ki
3.4±n/a nM
Citation
 M'Kadmi, CCabral, ABarrile, FGiribaldi, JCantel, SDamian, MMary, SDenoyelle, SDutertre, SPéraldi-Roux, SNeasta, JOiry, CBanères, JLMarie, JPerello, MFehrentz, JA N-Terminal Liver-Expressed Antimicrobial Peptide 2 (LEAP2) Region Exhibits Inverse Agonist Activity toward the Ghrelin Receptor. J Med Chem 62:965-973 (2019)  
Target
Name:
Growth hormone secretagogue receptor type 1
Synonyms:
GH-releasing peptide receptor GHS-R GHSR_HUMAN Ghrelin receptor | Ghrelin receptor 1a (GHS-R1a)
Type:
Receptor
Mol. Mass.:
41334.57
Organism:
Homo sapiens (Human)
Description:
Receptor binding studies use plasma membranes from LLC PK-1 cells transiently transfected with hGHSR1a.
Residue:
366
  
Inhibitor
Name:
BDBM50517279
Synonyms:
CHEMBL4456830
Type:
Small organic molecule
Emp. Form.:
C57H87N15O12
Mol. Mass.:
1174.394
SMILES:
CCCC[C@H](N)C(=O)N[C@@H]([C@@H](C)O)C(=O)N1CCC[C@H]1C(=O)N[C@@H](Cc1ccccc1)C(=O)N[C@@H](Cc1c[nH]c2ccccc12)C(=O)N[C@@H](CCCNC(N)=N)C(=O)NCC(=O)N[C@@H](C(C)C)C(=O)N[C@@H](CO)C(=O)N[C@@H](CC(C)C)C(N)=O
: