Target
Inositol polyphosphate multikinase
Ligand
BDBM23409
Substrate
Meas. Tech.
ChEMBL_1868988 (CHEMBL4370054)
IC50
2200±n/a nM
Citation
 Gu, CStashko, MAPuhl-Rubio, ACChakraborty, MChakraborty, AFrye, SVPearce, KHWang, XShears, SBWang, H Inhibition of Inositol Polyphosphate Kinases by Quercetin and Related Flavonoids: A Structure-Activity Analysis. J Med Chem 62:1443-1454 (2019)  
Target
Name:
Inositol polyphosphate multikinase
Synonyms:
2.7.1.140 2.7.1.153 IPMK Inositol 1,3,4,6-tetrakisphosphate 5-kinase | Inositol polyphosphate multikinase
Type:
PROTEIN
Mol. Mass.:
47229.24
Organism:
Homo sapiens
Description:
ChEMBL_119151
Residue:
416
  
Inhibitor
Name:
BDBM23409
Synonyms:
3,5,7-trihydroxy-2-(4-hydroxy-3-methoxyphenyl)-4H-chromen-4-one Isorhamnetin | Isorhamnetin (17)
Type:
flavonol
Emp. Form.:
C16H12O7
Mol. Mass.:
316.2623
SMILES:
COc1cc(ccc1O)-c1oc2cc(O)cc(O)c2c(=O)c1O
: