Target
Chymotrypsin-C
Ligand
BDBM50072290
Substrate
Meas. Tech.
ChEBML_49751
IC50
7±n/a nM
Citation
 Finch, HPegg, NAMcLaren, JLowdon, ABolton, RCoote, SJDyer, UMontana, JGOwen, MRDowle, MBuckley, DRoss, BCCampbell, CDix, CMooney, CMan-Tang, CPatel, C 5,5-trans lactone-containing inhibitors of serine proteases: identification of a novel, acylating thrombin inhibitor. Bioorg Med Chem Lett 8:2955-60 (1999)  
Target
Name:
Chymotrypsin-C
Synonyms:
CLCR CTRC_HUMAN Chymotrypsin Chymotrypsin-C
Type:
Enzyme
Mol. Mass.:
29487.98
Organism:
Homo sapiens (Human)
Description:
Q99895
Residue:
268
  
Inhibitor
Name:
BDBM50072290
Synonyms:
(3S,3aR,6aS)-3-Allyl-hexahydro-cyclopenta[b]furan-2-one | CHEMBL102115
Type:
Small organic molecule
Emp. Form.:
C10H14O2
Mol. Mass.:
166.217
SMILES:
C=CC[C@H]1[C@H]2CCC[C@@H]2OC1=O
: