Target
Genome polyprotein
Ligand
BDBM50110118
Substrate
Meas. Tech.
ChEMBL_1869979 (CHEMBL4371146)
Ki
700±n/a nM
Citation
 Meanwell, NA Fluorine and Fluorinated Motifs in the Design and Application of Bioisosteres for Drug Design. J Med Chem 61:5822-5880 (2018)  
Target
Name:
Genome polyprotein
Synonyms:
Protease NS3/Non-structural protein 4A (NS3/NS4A) | Protease NS3/Non-structural protein 4A (NS3/NS4A) (D168V)
Type:
Enzyme
Mol. Mass.:
19121.30
Organism:
Hepatitis C virus genotype 1b (isolate Con1) (HCV)
Description:
Q91RS4
Residue:
181
  
Inhibitor
Name:
BDBM50110118
Synonyms:
2-[2-(2-{2-[2-(2-Acetylamino-3-carboxy-propionylamino)-4-carboxy-butyrylamino]-3,3-diphenyl-propionylamino}-4-carboxy-butyrylamino)-3-cyclohexyl-propionylamino]-butyric acid | CHEMBL159723
Type:
Small organic molecule
Emp. Form.:
C44H58N6O14
Mol. Mass.:
894.9631
SMILES:
CC[C@H](NC(=O)[C@H](CC1CCCCC1)NC(=O)[C@H](CCC(O)=O)NC(=O)[C@@H](NC(=O)[C@H](CCC(O)=O)NC(=O)[C@H](CC(O)=O)NC(C)=O)C(c1ccccc1)c1ccccc1)C(O)=O
: