Target
Aurora kinase A
Ligand
BDBM87052
Substrate
Meas. Tech.
ChEMBL_1869945 (CHEMBL4371112)
Kd
16±n/a nM
Citation
 Meanwell, NA Fluorine and Fluorinated Motifs in the Design and Application of Bioisosteres for Drug Design. J Med Chem 61:5822-5880 (2018)  
Target
Name:
Aurora kinase A
Synonyms:
AIK ARK-1 AURA AURKA_HUMAN Aurora 2 Aurora kinase A (AURKA) Aurora kinase A (Aurora-2) Aurora/IPL1-related kinase 1 Breast tumor-amplified kinase IAK1 STK15 GN Serine/threonine kinase 15 Serine/threonine-protein kinase 6 Serine/threonine-protein kinase aurora-A aurora-2 | hARK1
Type:
Serine/threonine-protein kinase
Mol. Mass.:
45830.98
Organism:
Homo sapiens (Human)
Description:
O14965
Residue:
403
  
Inhibitor
Name:
BDBM87052
Synonyms:
Bisanilinopyrimidine inhibitor, 6 US9249124, 24
Type:
Small organic molecule
Emp. Form.:
C17H13FN4O2
Mol. Mass.:
324.3091
SMILES:
OC(=O)c1ccc(Nc2nccc(Nc3ccccc3F)n2)cc1
: