Target
Kappa-type opioid receptor
Ligand
BDBM50325534
Substrate
Meas. Tech.
ChEMBL_1870382 (CHEMBL4371549)
EC50
5.2±n/a nM
Citation
 Tan, LYan, WMcCorvy, JDCheng, J Biased Ligands of G Protein-Coupled Receptors (GPCRs): Structure-Functional Selectivity Relationships (SFSRs) and Therapeutic Potential. J Med Chem 61:9841-9878 (2018)  
Target
Name:
Kappa-type opioid receptor
Synonyms:
KOR-1 OPIATE Kappa Opioid receptor Ror-d
Type:
G Protein-Coupled Receptor (GPCR)
Mol. Mass.:
42692.90
Organism:
Rattus norvegicus (rat)
Description:
P34975
Residue:
380
  
Inhibitor
Name:
BDBM50325534
Synonyms:
CHEMBL267495 | nalfurafine
Type:
Small organic molecule
Emp. Form.:
C28H32N2O5
Mol. Mass.:
476.5641
SMILES:
CN([C@@H]1CC[C@@]2(O)[C@H]3Cc4ccc(O)c5O[C@@H]1[C@]2(CCN3CC1CC1)c45)C(=O)\C=C\c1ccoc1
: