Target
Stromelysin-1
Ligand
BDBM50072583
Substrate
Meas. Tech.
ChEBML_102122
IC50
1.2±n/a nM
Citation
 Sheppard, GSFlorjancic, ASGiesler, JRXu, LGuo, YDavidsen, SKMarcotte, PAElmore, IAlbert, DHMagoc, TJBouska, JJGoodfellow, CLMorgan, DWSummers, JB Aryl ketones as novel replacements for the C-terminal amide bond of succinyl hydroxamate MMP inhibitors. Bioorg Med Chem Lett 8:3251-6 (1999)  
Target
Name:
Stromelysin-1
Synonyms:
MMP-3 MMP3_HUMAN Matrix metalloproteinase 3 Matrix metalloproteinase-3 (MMP-3) SL-1 Stromelysin 1 | Transin-1
Type:
Enzyme
Mol. Mass.:
53973.13
Organism:
Homo sapiens (Human)
Description:
P08254
Residue:
477
  
Inhibitor
Name:
BDBM50072583
Synonyms:
(2R,3S)-2,N*1*-Dihydroxy-N*4*-[(S)-1-(1H-indole-3-carbonyl)-2,2-dimethyl-propyl]-3-isobutyl-succinamide | CHEMBL321180
Type:
Small organic molecule
Emp. Form.:
C22H31N3O5
Mol. Mass.:
417.4986
SMILES:
CC(C)C[C@H]([C@H](O)C(=O)NO)C(=O)N[C@H](C(=O)c1c[nH]c2ccccc12)C(C)(C)C
: