Target
Receptor-type tyrosine-protein phosphatase eta
Ligand
BDBM50071058
Substrate
Meas. Tech.
ChEMBL_1871280 (CHEMBL4372447)
IC50
111500±n/a nM
Citation
 Kyriakou, ESchmidt, SDodd, GTPfuhlmann, KSimonds, SELenhart, DGeerlof, ASchriever, SCDe Angelis, MSchramm, KWPlettenburg, OCowley, MATiganis, TTschöp, MHPfluger, PTSattler, MMessias, AC Celastrol Promotes Weight Loss in Diet-Induced Obesity by Inhibiting the Protein Tyrosine Phosphatases PTP1B and TCPTP in the Hypothalamus. J Med Chem 61:11144-11157 (2018)  
Target
Name:
Receptor-type tyrosine-protein phosphatase eta
Synonyms:
DEP1 PTPRJ Protein-tyrosine phosphatase Receptor-type tyrosine-protein phosphatase eta (DEP1)
Type:
Protein
Mol. Mass.:
145920.57
Organism:
Homo sapiens (Human)
Description:
Q12913
Residue:
1337
  
Inhibitor
Name:
BDBM50071058
Synonyms:
(2R,4aS,6aS,12bR,14aS,14bR)-10-Hydroxy-2,4a,6a,9,12b,14a-hexamethyl-11-oxo-1,2,3,4,4a,5,6,6a,11,12b,13,14,14a,14b-tetradecahydro-picene-2-carboxylic acid CHEMBL301982 | cid_4274774
Type:
Small organic molecule
Emp. Form.:
C29H38O4
Mol. Mass.:
450.6096
SMILES:
C[C@]12CC[C@](C)(C[C@H]1[C@]1(C)CC[C@]3(C)C(=CC=c4c3cc(O)c(O)c4=C)[C@@]1(C)CC2)C(O)=O
: