Target
Chloride anion exchanger
Ligand
BDBM50519184
Substrate
Meas. Tech.
ChEMBL_1874150 (CHEMBL4375439)
IC50
>5000±n/a nM
Citation
 Lee, SCil, OHaggie, PMVerkman, AS 4,8-Dimethylcoumarin Inhibitors of Intestinal Anion Exchanger slc26a3 (Downregulated in Adenoma) for Anti-Absorptive Therapy of Constipation. J Med Chem 62:8330-8337 (2019)  
Target
Name:
Chloride anion exchanger
Synonyms:
Chloride anion exchanger Dra S26A3_MOUSE Solute carrier family 26 member 3
Type:
PROTEIN
Mol. Mass.:
83598.25
Organism:
Mus musculus
Description:
ChEMBL_119253
Residue:
757
  
Inhibitor
Name:
BDBM50519184
Synonyms:
CHEMBL4564240
Type:
Small organic molecule
Emp. Form.:
C20H19NO6
Mol. Mass.:
369.368
SMILES:
Cc1c(OCc2cccc(CO)n2)ccc2c(C)c(CC(O)=O)c(=O)oc12
: