Target
D(3) dopamine receptor
Ligand
BDBM50073272
Substrate
Meas. Tech.
ChEBML_62283
Ki
74±n/a nM
Citation
 Terán, CSantana, LUriarte, EFall, YUnelius, LTolf, BR Phenylpiperazine derivatives with strong affinity for 5HT1A, D2A and D3 receptors. Bioorg Med Chem Lett 8:3567-70 (1999)  
Target
Name:
D(3) dopamine receptor
Synonyms:
DOPAMINE D3 DRD3_HUMAN Dopamine D3 receptor (D3) Dopamine receptor Dopamine receptor D3
Type:
Mol. Mass.:
44243.43
Organism:
Homo sapiens (Human)
Description:
Residue:
400
  
Inhibitor
Name:
BDBM50073272
Synonyms:
4-Methyl-7-[3-(4-phenyl-piperazin-1-yl)-propoxy]-chromen-2-one | CHEMBL52096
Type:
Small organic molecule
Emp. Form.:
C23H26N2O3
Mol. Mass.:
378.4641
SMILES:
Cc1cc(=O)oc2cc(OCCCN3CCN(CC3)c3ccccc3)ccc12
: