Target
D(2) dopamine receptor
Ligand
BDBM50073272
Substrate
Meas. Tech.
ChEBML_61452
Ki
14±n/a nM
Citation
 Terán, CSantana, LUriarte, EFall, YUnelius, LTolf, BR Phenylpiperazine derivatives with strong affinity for 5HT1A, D2A and D3 receptors. Bioorg Med Chem Lett 8:3567-70 (1999)  
Target
Name:
D(2) dopamine receptor
Synonyms:
D(2) dopamine receptor DOPAMINE D2 Long DRD2 Dopamine D2 receptor Dopamine D2 receptor (D2R) Dopamine2-like | d2
Type:
Cell-surface receptors
Mol. Mass.:
50647.10
Organism:
Homo sapiens (Human)
Description:
P14416
Residue:
443
  
Inhibitor
Name:
BDBM50073272
Synonyms:
4-Methyl-7-[3-(4-phenyl-piperazin-1-yl)-propoxy]-chromen-2-one | CHEMBL52096
Type:
Small organic molecule
Emp. Form.:
C23H26N2O3
Mol. Mass.:
378.4641
SMILES:
Cc1cc(=O)oc2cc(OCCCN3CCN(CC3)c3ccccc3)ccc12
: