Target
5-hydroxytryptamine receptor 1A
Ligand
BDBM50073272
Substrate
Meas. Tech.
ChEBML_201038
Ki
5.5±n/a nM
Citation
 Terán, CSantana, LUriarte, EFall, YUnelius, LTolf, BR Phenylpiperazine derivatives with strong affinity for 5HT1A, D2A and D3 receptors. Bioorg Med Chem Lett 8:3567-70 (1999)  
Target
Name:
5-hydroxytryptamine receptor 1A
Synonyms:
5-HT-1A 5-HT1A 5-hydroxytryptamine receptor 1A (5HT1A) 5ht1a Htr1a Serotonin 1a (5-HT1a) receptor/Adrenergic receptor alpha-1 | Serotonin receptor 1A
Type:
G Protein-Coupled Receptor (GPCR)
Mol. Mass.:
46445.29
Organism:
Rattus norvegicus (rat)
Description:
Binding assays were performed using rat hippocampal membranes.
Residue:
422
  
Inhibitor
Name:
BDBM50073272
Synonyms:
4-Methyl-7-[3-(4-phenyl-piperazin-1-yl)-propoxy]-chromen-2-one | CHEMBL52096
Type:
Small organic molecule
Emp. Form.:
C23H26N2O3
Mol. Mass.:
378.4641
SMILES:
Cc1cc(=O)oc2cc(OCCCN3CCN(CC3)c3ccccc3)ccc12
: