Target
Cathepsin L2
Ligand
BDBM50519378
Substrate
Meas. Tech.
ChEMBL_1875048 (CHEMBL4376337)
IC50
1400±n/a nM
Citation
 Menezes, JCJMDSDiederich, MF Natural dimers of coumarin, chalcones, and resveratrol and the link between structure and pharmacology. Eur J Med Chem 182:0 (2019)  
Target
Name:
Cathepsin L2
Synonyms:
CATL2 CTSL2 CTSV Cathepsin V
Type:
Enzyme
Mol. Mass.:
37341.06
Organism:
Homo sapiens (Human)
Description:
O60911
Residue:
334
  
Inhibitor
Name:
BDBM50519378
Synonyms:
CHEMBL4576261
Type:
Small organic molecule
Emp. Form.:
C30H24O9
Mol. Mass.:
528.5062
SMILES:
O[C@@H]1[C@@H]([C@@H]([C@H](c2ccc(O)cc2)c2cc(O)c(O)cc12)C(=O)c1ccc(O)cc1O)C(=O)c1ccc(O)cc1
: