Target
Alpha-1B adrenergic receptor
Ligand
BDBM50073573
Substrate
Meas. Tech.
ChEMBL_32304 (CHEMBL646250)
Ki
4.43±n/a nM
Citation
 Leonardi, AMotta, GBoi, CTesta, RPoggesi, EDe Benedetti, PGMenziani, MC Synthesis, pharmacological evaluation, and structure-activity relationship and quantitative structure-activity relationship studies on novel derivatives of 2,4-diamino-6,7-dimethoxyquinazoline alpha1-adrenoceptor antagonists. J Med Chem 42:427-37 (1999)  
Target
Name:
Alpha-1B adrenergic receptor
Synonyms:
ADA1B_HUMAN Adrenergic alpha1B Adrenergic receptor alpha Alpha 1B-adrenoreceptor | Alpha-1B adrenergic receptor
Type:
Enzyme
Mol. Mass.:
56862.13
Organism:
Homo sapiens (Human)
Description:
P35368
Residue:
520
  
Inhibitor
Name:
BDBM50073573
Synonyms:
1-[4-(4-Amino-6,7-dimethoxy-quinazolin-2-yl)-piperazin-1-yl]-4-phenyl-butane-1,4-dione | CHEMBL424658
Type:
Small organic molecule
Emp. Form.:
C24H27N5O4
Mol. Mass.:
449.5023
SMILES:
COc1cc2nc(nc(N)c2cc1OC)N1CCN(CC1)C(=O)CCC(=O)c1ccccc1
: