Target
Glucagon-like peptide 2 receptor
Ligand
BDBM50519608
Substrate
Meas. Tech.
ChEMBL_1877070 (CHEMBL4378464)
EC50
0.090000±n/a nM
Citation
 Suzuki, RBrown, GAChristopher, JAScully, CCGCongreve, M Recent Developments in Therapeutic Peptides for the Glucagon-like Peptide 1 and 2 Receptors. J Med Chem 63:905-927 (2020)  
Target
Name:
Glucagon-like peptide 2 receptor
Synonyms:
GLP-2 receptor GLP-2R GLP2R_HUMAN
Type:
PROTEIN
Mol. Mass.:
63023.90
Organism:
Homo sapiens (Human)
Description:
ChEMBL_876141
Residue:
553
  
Inhibitor
Name:
BDBM50519608
Synonyms:
CHEMBL4534113
Type:
Small organic molecule
Emp. Form.:
C165H252N42O52
Mol. Mass.:
3656.0166
SMILES:
CC[C@H](C)[C@H](NC(=O)[C@H](Cc1ccccc1)NC(=O)[C@H](CC(O)=O)NC(=O)[C@H](CCCNC(N)=N)NC(=O)[C@H](C)NC(=O)[C@H](C)NC(=O)[C@H](CC(C)C)NC(=O)[C@H](C)NC(=O)[C@H](CC(O)=O)NC(=O)[C@H](CC(C)C)NC(=O)[C@H](Cc1ccc(O)cc1)NC(=O)[C@@H](NC(=O)[C@H](CO)NC(=O)[C@H](CC(C)C)NC(=O)[C@H](CCC(O)=O)NC(=O)[C@H](CO)NC(=O)[C@@H](NC(=O)[C@H](Cc1ccccc1)NC(=O)[C@H](CO)NC(=O)CNC(=O)[C@H](CC(O)=O)NC(=O)CNC(=O)[C@@H](N)Cc1cnc[nH]1)[C@@H](C)O)[C@@H](C)O)C(=O)N[C@@H](C)C(=O)N[C@@H](Cc1c[nH]c2ccccc12)C(=O)N[C@@H](CC(C)C)C(=O)N[C@@H]([C@@H](C)CC)C(=O)N[C@@H](CCC(N)=O)C(=O)N[C@@H]([C@@H](C)O)C(=O)N[C@@H](CCCCN)C(=O)N[C@@H]([C@@H](C)CC)C(=O)N[C@@H]([C@@H](C)O)C(=O)N[C@@H](CC(O)=O)C(N)=O
: