Target
Calcium/calmodulin-dependent protein kinase type 1
Ligand
BDBM50519662
Substrate
Meas. Tech.
ChEMBL_1877762 (CHEMBL4379156)
IC50
>10000±n/a nM
Citation
 Zhao, LLi, YWang, YQiao, ZMiao, ZYang, JHuang, LTian, CLi, LChen, DYang, S Discovery of 4 J Med Chem 62:10691-10710 (2019)  
Target
Name:
Calcium/calmodulin-dependent protein kinase type 1
Synonyms:
CAMK1 CaM kinase I alpha CaMKI-alpha KCC1A_HUMAN
Type:
PROTEIN
Mol. Mass.:
41325.04
Organism:
Homo sapiens (Human)
Description:
ChEMBL_655701
Residue:
370
  
Inhibitor
Name:
BDBM50519662
Synonyms:
CHEMBL4438748
Type:
Small organic molecule
Emp. Form.:
C26H23N3O5
Mol. Mass.:
457.4779
SMILES:
CN(C)c1ccc(cc1)C(=O)Nc1cccc(NC(=O)COc2ccc3c(c2)occc3=O)c1
: