Target
Phosphatidylinositol 4,5-bisphosphate 3-kinase catalytic subunit gamma isoform
Ligand
BDBM50380363
Substrate
Meas. Tech.
ChEMBL_1878937 (CHEMBL4380331)
IC50
263±n/a nM
Citation
 Wang, JLi, HHe, GChu, ZPeng, KGe, YZhu, QXu, Y Discovery of Novel Dual Poly(ADP-ribose)polymerase and Phosphoinositide 3-Kinase Inhibitors as a Promising Strategy for Cancer Therapy. J Med Chem 63:122-139 (2020)  
Target
Name:
Phosphatidylinositol 4,5-bisphosphate 3-kinase catalytic subunit gamma isoform
Synonyms:
PI3-kinase p110 subunit gamma PI3Kgamma PK3CG_HUMAN Phosphatidylinositol 4,5-bisphosphate 3-kinase (PI3K) Phosphatidylinositol 4,5-bisphosphate 3-kinase catalytic subunit gamma (PI3Kgamma) Phosphatidylinositol 4,5-bisphosphate 3-kinase catalytic subunit gamma isoform (PI3K) Phosphatidylinositol-4,5-bisphosphate 3-kinase catalytic subunit gamma isoform Phosphoinositide 3-kinases gamma (PI3K gamma) p120-PI3K
Type:
Enzyme Subunit
Mol. Mass.:
126470.30
Organism:
Homo sapiens (Human)
Description:
P48736
Residue:
1102
  
Inhibitor
Name:
BDBM50380363
Synonyms:
CHEMBL2017974 | US10173995, Compound 1
Type:
Small organic molecule
Emp. Form.:
C18H21F3N6O2
Mol. Mass.:
410.3935
SMILES:
Nc1cc(c(cn1)-c1cc(nc(n1)N1CCOCC1)N1CCOCC1)C(F)(F)F
: