Target
5-hydroxytryptamine receptor 1D
Ligand
BDBM50060426
Substrate
Meas. Tech.
ChEMBL_1702 (CHEMBL616909)
IC50
0.3±n/a nM
Citation
 Chambers, MSStreet, LJGoodacre, SHobbs, SCHunt, PJelley, RAMatassa, VGReeve, AJSternfeld, FBeer, MSStanton, JARathbone, DWatt, APMacLeod, AM 3-(Piperazinylpropyl)indoles: selective, orally bioavailable h5-HT1D receptor agonists as potential antimigraine agents. J Med Chem 42:691-705 (1999)  
Target
Name:
5-hydroxytryptamine receptor 1D
Synonyms:
5-HT-1D 5-HT1D 5HT1D_HUMAN HTR1DA Serotonin (5-HT) receptor | Serotonin Receptor 1D
Type:
G Protein-Coupled Receptor (GPCR)
Mol. Mass.:
41920.63
Organism:
Homo sapiens (Human)
Description:
Receptor binding assays were performed using human clone stably expressed in CHO cells.
Residue:
377
  
Inhibitor
Name:
BDBM50060426
Synonyms:
CHEMBL296161 L-741604
Type:
Small organic molecule
Emp. Form.:
C14H17N5
Mol. Mass.:
255.3183
SMILES:
CN(C)CCc1c[nH]c2ccc(cc12)-n1cnnc1
: