Target
Retinoic acid receptor alpha
Ligand
BDBM50074295
Substrate
Meas. Tech.
ChEMBL_195329 (CHEMBL802572)
Ki
>10000±n/a nM
Citation
 Canan Koch, SSDardashti, LJCesario, RMCroston, GEBoehm, MFHeyman, RANadzan, AM Synthesis of retinoid X receptor-specific ligands that are potent inducers of adipogenesis in 3T3-L1 cells. J Med Chem 42:742-50 (1999)  
Target
Name:
Retinoic acid receptor alpha
Synonyms:
NR1B1 RAR-alpha RARA_HUMAN Retinoic acid receptor alpha/Retinoid X receptor alpha Retinoid receptor
Type:
PROTEIN
Mol. Mass.:
50778.87
Organism:
Homo sapiens (Human)
Description:
ChEMBL_1466191
Residue:
462
  
Inhibitor
Name:
BDBM50074295
Synonyms:
4-[[(E)-Methoxyimino]-(3,5,5,8,8-pentamethyl-5,6,7,8-tetrahydro-naphthalen-2-yl)-methyl]-benzoic acid | CHEMBL423465
Type:
Small organic molecule
Emp. Form.:
C24H29NO3
Mol. Mass.:
379.492
SMILES:
CO\N=C(/c1ccc(cc1)C(O)=O)c1cc2c(cc1C)C(C)(C)CCC2(C)C
: