Target
Muscarinic acetylcholine receptor M2
Ligand
BDBM50074559
Substrate
Meas. Tech.
ChEMBL_139910 (CHEMBL746846)
EC50
8820±n/a nM
Citation
 Nassif-Makki, TTränkle, CZlotos, DBejeuhr, GCambareri, APfletschinger, CKostenis, EMohr, KHolzgrabe, U Bisquaternary ligands of the common allosteric site of M2 acetylcholine receptors: search for the minimum essential distances between the pharmacophoric elements. J Med Chem 42:849-58 (1999)  
Target
Name:
Muscarinic acetylcholine receptor M2
Synonyms:
ACM2_PIG Cholinergic, muscarinic LOC100715343 Muscarinic receptor 2
Type:
Enzyme Catalytic Domain
Mol. Mass.:
51688.65
Organism:
GUINEA PIG
Description:
Cholinergic, muscarinic 0 GUINEA PIG::P06199
Residue:
466
  
Inhibitor
Name:
BDBM50074559
Synonyms:
Bis-[3-(1,3-dioxo-1,3-dihydro-isoindol-2-yl)-propyl]-dimethyl-ammonium; bromide | CHEMBL171215
Type:
Small organic molecule
Emp. Form.:
C24H26N3O4
Mol. Mass.:
420.4804
SMILES:
C[N+](C)(CCCN1C(=O)c2ccccc2C1=O)CCCN1C(=O)c2ccccc2C1=O
: