Target
Muscarinic acetylcholine receptor M2
Ligand
BDBM50074558
Substrate
Meas. Tech.
ChEMBL_139910 (CHEMBL746846)
EC50
370±n/a nM
Citation
 Nassif-Makki, TTränkle, CZlotos, DBejeuhr, GCambareri, APfletschinger, CKostenis, EMohr, KHolzgrabe, U Bisquaternary ligands of the common allosteric site of M2 acetylcholine receptors: search for the minimum essential distances between the pharmacophoric elements. J Med Chem 42:849-58 (1999)  
Target
Name:
Muscarinic acetylcholine receptor M2
Synonyms:
ACM2_PIG Cholinergic, muscarinic LOC100715343 Muscarinic receptor 2
Type:
Enzyme Catalytic Domain
Mol. Mass.:
51688.65
Organism:
GUINEA PIG
Description:
Cholinergic, muscarinic 0 GUINEA PIG::P06199
Residue:
466
  
Inhibitor
Name:
BDBM50074558
Synonyms:
Bis-{3-(1,3-dioxo-2,3-dihydro-1H-2-isoindolyl)propyl(trimethyl)ammonium}pentane; dibromide | CHEMBL168840
Type:
Small organic molecule
Emp. Form.:
C33H46N4O4
Mol. Mass.:
562.7416
SMILES:
C[N+](C)(CCCCCCC[N+](C)(C)CCCN1C(=O)c2ccccc2C1=O)CCCN1C(=O)c2ccccc2C1=O
: