Target
Muscarinic acetylcholine receptor M2
Ligand
BDBM50074562
Substrate
Meas. Tech.
ChEMBL_139910 (CHEMBL746846)
EC50
1900±n/a nM
Citation
 Nassif-Makki, TTränkle, CZlotos, DBejeuhr, GCambareri, APfletschinger, CKostenis, EMohr, KHolzgrabe, U Bisquaternary ligands of the common allosteric site of M2 acetylcholine receptors: search for the minimum essential distances between the pharmacophoric elements. J Med Chem 42:849-58 (1999)  
Target
Name:
Muscarinic acetylcholine receptor M2
Synonyms:
ACM2_PIG Cholinergic, muscarinic LOC100715343 Muscarinic receptor 2
Type:
Enzyme Catalytic Domain
Mol. Mass.:
51688.65
Organism:
GUINEA PIG
Description:
Cholinergic, muscarinic 0 GUINEA PIG::P06199
Residue:
466
  
Inhibitor
Name:
BDBM50074562
Synonyms:
Bis-{4-[(1,3-Dioxo-1,3-dihydro-isoindol-2-ylmethoxyimino)-methyl]-1-ethyl-pyridinium}dibromide | CHEMBL171388
Type:
Small organic molecule
Emp. Form.:
C34H30N6O6
Mol. Mass.:
618.6375
SMILES:
O=C1N(CO\N=C\c2cc[n+](CCCC[n+]3ccc(\C=N\OCN4C(=O)c5ccccc5C4=O)cc3)cc2)C(=O)c2ccccc12
: