Target
Muscarinic acetylcholine receptor M2
Ligand
BDBM50074566
Substrate
Meas. Tech.
ChEMBL_139910 (CHEMBL746846)
EC50
4650±n/a nM
Citation
 Nassif-Makki, TTränkle, CZlotos, DBejeuhr, GCambareri, APfletschinger, CKostenis, EMohr, KHolzgrabe, U Bisquaternary ligands of the common allosteric site of M2 acetylcholine receptors: search for the minimum essential distances between the pharmacophoric elements. J Med Chem 42:849-58 (1999)  
Target
Name:
Muscarinic acetylcholine receptor M2
Synonyms:
ACM2_PIG Cholinergic, muscarinic LOC100715343 Muscarinic receptor 2
Type:
Enzyme Catalytic Domain
Mol. Mass.:
51688.65
Organism:
GUINEA PIG
Description:
Cholinergic, muscarinic 0 GUINEA PIG::P06199
Residue:
466
  
Inhibitor
Name:
BDBM50074566
Synonyms:
2-{4-[4-(3-{1-[4-(1,3-dioxo-2,3-dihydro-1H-2-isoindolyl)butyl]-4-pyridiniumyl}propyl)-1-pyridiniumyl]butyl}-1,3-isoindolinedione; dibromide | CHEMBL354750
Type:
Small organic molecule
Emp. Form.:
C34H32N4O4
Mol. Mass.:
560.6412
SMILES:
O=C1N(CCCC[n+]2ccc(cc2)-c2cc[n+](CCCCN3C(=O)c4ccccc4C3=O)cc2)C(=O)c2ccccc12
: