Target
Muscarinic acetylcholine receptor M2
Ligand
BDBM50074570
Substrate
Meas. Tech.
ChEMBL_139910 (CHEMBL746846)
EC50
3490±n/a nM
Citation
 Nassif-Makki, TTränkle, CZlotos, DBejeuhr, GCambareri, APfletschinger, CKostenis, EMohr, KHolzgrabe, U Bisquaternary ligands of the common allosteric site of M2 acetylcholine receptors: search for the minimum essential distances between the pharmacophoric elements. J Med Chem 42:849-58 (1999)  
Target
Name:
Muscarinic acetylcholine receptor M2
Synonyms:
ACM2_PIG Cholinergic, muscarinic LOC100715343 Muscarinic receptor 2
Type:
Enzyme Catalytic Domain
Mol. Mass.:
51688.65
Organism:
GUINEA PIG
Description:
Cholinergic, muscarinic 0 GUINEA PIG::P06199
Residue:
466
  
Inhibitor
Name:
BDBM50074570
Synonyms:
2-(4-{3-[1-(1,3-dioxo-2,3-dihydro-1H-2-isoindolylmethyl)-4-pyridiniumyl]propyl}-1-pyridiniumylmethyl)-1,3-isoindolinedione; dibromide | CHEMBL352356
Type:
Small organic molecule
Emp. Form.:
C33H30N4O4
Mol. Mass.:
546.6146
SMILES:
O=C1N(CC[n+]2ccc(CCCc3cc[n+](CCN4C(=O)c5ccccc5C4=O)cc3)cc2)C(=O)c2ccccc12
: