Target
Muscarinic acetylcholine receptor M2
Ligand
BDBM50074571
Substrate
Meas. Tech.
ChEMBL_139910 (CHEMBL746846)
EC50
450±n/a nM
Citation
 Nassif-Makki, TTränkle, CZlotos, DBejeuhr, GCambareri, APfletschinger, CKostenis, EMohr, KHolzgrabe, U Bisquaternary ligands of the common allosteric site of M2 acetylcholine receptors: search for the minimum essential distances between the pharmacophoric elements. J Med Chem 42:849-58 (1999)  
Target
Name:
Muscarinic acetylcholine receptor M2
Synonyms:
ACM2_PIG Cholinergic, muscarinic LOC100715343 Muscarinic receptor 2
Type:
Enzyme Catalytic Domain
Mol. Mass.:
51688.65
Organism:
GUINEA PIG
Description:
Cholinergic, muscarinic 0 GUINEA PIG::P06199
Residue:
466
  
Inhibitor
Name:
BDBM50074571
Synonyms:
Bis-{4-{[3-(1,3-Dioxo-1,3-dihydro-isoindol-2-yl)-propoxyimino]-methyl}-1-methyl-pyridinium}propane; dibromide | CHEMBL169633
Type:
Small organic molecule
Emp. Form.:
C40H42N6O6
Mol. Mass.:
702.797
SMILES:
O=C1N(CCCO\N=C\c2cc[n+](CCCCCC[n+]3ccc(\C=N\OCCCN4C(=O)c5ccccc5C4=O)cc3)cc2)C(=O)c2ccccc12
: