Target
Sodium channel protein type 4 subunit alpha
Ligand
BDBM50520482
Substrate
Meas. Tech.
ChEMBL_1880488 (CHEMBL4381882)
IC50
69±n/a nM
Citation
 Xu, PKaas, QWu, YZhu, XLi, XHarvey, PJZhangsun, DCraik, DJLuo, S Structure and Activity Studies of Disulfide-Deficient Analogues of ?O-Conotoxin GeXIVA. J Med Chem 63:1564-1575 (2020)  
Target
Name:
Sodium channel protein type 4 subunit alpha
Synonyms:
SCN4A_RAT Sodium channel protein type IV alpha subunit Voltage-gated sodium channel subunit alpha Nav1.4 (I757A) | Voltage-gated sodium channel subunit alpha Nav1.4 (M1240A)
Type:
Enzyme
Mol. Mass.:
208810.50
Organism:
Rattus norvegicus (Rat)
Description:
P15390
Residue:
1840
  
Inhibitor
Name:
BDBM50520482
Synonyms:
CHEMBL4562161
Type:
Small organic molecule
Emp. Form.:
C100H170N38O32S6
Mol. Mass.:
2609.045
SMILES:
C[C@@H](O)[C@@H]1NC(=O)[C@@H]2CSSC[C@@H]3NC(=O)[C@H](CCCNC(N)=N)NC(=O)[C@H](CCC(N)=O)NC(=O)[C@@H]4C[C@@H](O)CN4C(=O)[C@H](CCCCN)NC(=O)[C@H](CSSC[C@H](NC(=O)[C@H](CC(O)=O)NC(=O)[C@@H](N)CCCNC(N)=N)C(=O)N2)NC(=O)[C@H](CCC(N)=O)NC(=O)[C@H](CCCNC(N)=N)NC(=O)[C@H](CC(O)=O)NC(=O)[C@H](CCCCN)NC(=O)[C@H](CSSC[C@H](NC3=O)C(=O)N[C@@H](C)C(N)=O)NC(=O)[C@H](CCCCN)NC(=O)[C@H](CCCCN)NC(=O)[C@@H]2C[C@@H](O)CN2C(=O)[C@@H]2C[C@@H](O)CN2C1=O
: