Target
B2 bradykinin receptor
Ligand
BDBM50074982
Substrate
Meas. Tech.
ChEMBL_216335 (CHEMBL818749)
Ki
1.3±n/a nM
Citation
 Heitsch, HWagner, ASchölkens, BAWirth, K Novel series of O-substituted 8-quinolines and 4-benzothiazoles as potent antagonists of the bradykinin B2 receptors. Bioorg Med Chem Lett 9:327-32 (1999)  
Target
Name:
B2 bradykinin receptor
Synonyms:
B2 bradykinin receptor BDKRB2 BKRB2_CAVPO | Bradykinin B2 receptor
Type:
Mol. Mass.:
42217.03
Organism:
Cavia porcellus
Description:
Residue:
372
  
Inhibitor
Name:
BDBM50074982
Synonyms:
(E)-N-({[2,4-Dichloro-3-(2-methyl-benzothiazol-4-yloxymethyl)-phenyl]-methyl-carbamoyl}-methyl)-3-(3-methoxy-phenyl)-acrylamide | CHEMBL114732
Type:
Small organic molecule
Emp. Form.:
C28H25Cl2N3O4S
Mol. Mass.:
570.487
SMILES:
COc1cccc(\C=C\C(=O)NCC(=O)N(C)c2ccc(Cl)c(COc3cccc4sc(C)nc34)c2Cl)c1
: