Target
B2 bradykinin receptor
Ligand
BDBM50074985
Substrate
Meas. Tech.
ChEMBL_216335 (CHEMBL818749)
Ki
3.4±n/a nM
Citation
 Heitsch, HWagner, ASchölkens, BAWirth, K Novel series of O-substituted 8-quinolines and 4-benzothiazoles as potent antagonists of the bradykinin B2 receptors. Bioorg Med Chem Lett 9:327-32 (1999)  
Target
Name:
B2 bradykinin receptor
Synonyms:
B2 bradykinin receptor BDKRB2 BKRB2_CAVPO | Bradykinin B2 receptor
Type:
Mol. Mass.:
42217.03
Organism:
Cavia porcellus
Description:
Residue:
372
  
Inhibitor
Name:
BDBM50074985
Synonyms:
(E)-N-({[2,4-Dichloro-3-(2-methyl-benzothiazol-4-yloxymethyl)-phenyl]-methyl-carbamoyl}-methyl)-3-furan-2-yl-acrylamide | CHEMBL333832
Type:
Small organic molecule
Emp. Form.:
C25H21Cl2N3O4S
Mol. Mass.:
530.423
SMILES:
CN(C(=O)CNC(=O)\C=C\c1ccco1)c1ccc(Cl)c(COc2cccc3sc(C)nc23)c1Cl
: