Target
B2 bradykinin receptor
Ligand
BDBM50074978
Substrate
Meas. Tech.
ChEMBL_216335 (CHEMBL818749)
Ki
0.100000±n/a nM
Citation
 Heitsch, HWagner, ASchölkens, BAWirth, K Novel series of O-substituted 8-quinolines and 4-benzothiazoles as potent antagonists of the bradykinin B2 receptors. Bioorg Med Chem Lett 9:327-32 (1999)  
Target
Name:
B2 bradykinin receptor
Synonyms:
B2 bradykinin receptor BDKRB2 BKRB2_CAVPO | Bradykinin B2 receptor
Type:
Mol. Mass.:
42217.03
Organism:
Cavia porcellus
Description:
Residue:
372
  
Inhibitor
Name:
BDBM50074978
Synonyms:
2-[3-(4-Amino-butyl)-ureido]-N-[4-chloro-2-cyano-3-(2-methyl-quinolin-8-yloxymethyl)-phenyl]-N-methyl-acetamide | CHEMBL113169
Type:
Small organic molecule
Emp. Form.:
C26H29ClN6O3
Mol. Mass.:
509
SMILES:
CN(C(=O)CNC(=O)NCCCCN)c1ccc(Cl)c(COc2cccc3ccc(C)nc23)c1C#N
: