Target
B2 bradykinin receptor
Ligand
BDBM50074995
Substrate
Meas. Tech.
ChEMBL_216335 (CHEMBL818749)
Ki
45±n/a nM
Citation
 Heitsch, HWagner, ASchölkens, BAWirth, K Novel series of O-substituted 8-quinolines and 4-benzothiazoles as potent antagonists of the bradykinin B2 receptors. Bioorg Med Chem Lett 9:327-32 (1999)  
Target
Name:
B2 bradykinin receptor
Synonyms:
B2 bradykinin receptor BDKRB2 BKRB2_CAVPO | Bradykinin B2 receptor
Type:
Mol. Mass.:
42217.03
Organism:
Cavia porcellus
Description:
Residue:
372
  
Inhibitor
Name:
BDBM50074995
Synonyms:
(E)-N-({[2-Methoxy-3-(2-methyl-quinolin-8-yloxymethyl)-4-methylsulfanyl-phenyl]-methyl-carbamoyl}-methyl)-3-(4-trifluoromethyl-phenyl)-acrylamide | CHEMBL113176
Type:
Small organic molecule
Emp. Form.:
C32H30F3N3O4S
Mol. Mass.:
609.659
SMILES:
COc1c(COc2cccc3ccc(C)nc23)c(SC)ccc1N(C)C(=O)CNC(=O)\C=C\c1ccc(cc1)C(F)(F)F
: