Target
B2 bradykinin receptor
Ligand
BDBM50075000
Substrate
Meas. Tech.
ChEMBL_216335 (CHEMBL818749)
Ki
0.100000±n/a nM
Citation
 Heitsch, HWagner, ASchölkens, BAWirth, K Novel series of O-substituted 8-quinolines and 4-benzothiazoles as potent antagonists of the bradykinin B2 receptors. Bioorg Med Chem Lett 9:327-32 (1999)  
Target
Name:
B2 bradykinin receptor
Synonyms:
B2 bradykinin receptor BDKRB2 BKRB2_CAVPO | Bradykinin B2 receptor
Type:
Mol. Mass.:
42217.03
Organism:
Cavia porcellus
Description:
Residue:
372
  
Inhibitor
Name:
BDBM50075000
Synonyms:
(E)-N-({[4-Chloro-2-cyano-3-(2-methyl-quinolin-8-yloxymethyl)-phenyl]-methyl-carbamoyl}-methyl)-3-(3-methoxy-phenyl)-acrylamide | CHEMBL113963
Type:
Small organic molecule
Emp. Form.:
C31H27ClN4O4
Mol. Mass.:
555.023
SMILES:
COc1cccc(\C=C\C(=O)NCC(=O)N(C)c2ccc(Cl)c(COc3cccc4ccc(C)nc34)c2C#N)c1
: