Target
B2 bradykinin receptor
Ligand
BDBM50074996
Substrate
Meas. Tech.
ChEMBL_216335 (CHEMBL818749)
Ki
9.1±n/a nM
Citation
 Heitsch, HWagner, ASchölkens, BAWirth, K Novel series of O-substituted 8-quinolines and 4-benzothiazoles as potent antagonists of the bradykinin B2 receptors. Bioorg Med Chem Lett 9:327-32 (1999)  
Target
Name:
B2 bradykinin receptor
Synonyms:
B2 bradykinin receptor BDKRB2 BKRB2_CAVPO | Bradykinin B2 receptor
Type:
Mol. Mass.:
42217.03
Organism:
Cavia porcellus
Description:
Residue:
372
  
Inhibitor
Name:
BDBM50074996
Synonyms:
({[2,4-Dichloro-3-(2-methyl-benzothiazol-4-yloxymethyl)-phenyl]-methyl-carbamoyl}-methyl)-carbamic acid benzyl ester | CHEMBL325742
Type:
Small organic molecule
Emp. Form.:
C26H23Cl2N3O4S
Mol. Mass.:
544.45
SMILES:
CN(C(=O)CNC(=O)OCc1ccccc1)c1ccc(Cl)c(COc2cccc3sc(C)nc23)c1Cl
: