Target
B2 bradykinin receptor
Ligand
BDBM50074979
Substrate
Meas. Tech.
ChEMBL_216335 (CHEMBL818749)
Ki
6.3±n/a nM
Citation
 Heitsch, HWagner, ASchölkens, BAWirth, K Novel series of O-substituted 8-quinolines and 4-benzothiazoles as potent antagonists of the bradykinin B2 receptors. Bioorg Med Chem Lett 9:327-32 (1999)  
Target
Name:
B2 bradykinin receptor
Synonyms:
B2 bradykinin receptor BDKRB2 BKRB2_CAVPO | Bradykinin B2 receptor
Type:
Mol. Mass.:
42217.03
Organism:
Cavia porcellus
Description:
Residue:
372
  
Inhibitor
Name:
BDBM50074979
Synonyms:
(E)-3-(4-Methoxy-phenyl)-N-({methyl-[3-(2-methyl-quinolin-8-yloxymethyl)-2,4-bis-methylsulfanyl-phenyl]-carbamoyl}-methyl)-acrylamide | CHEMBL114915
Type:
Small organic molecule
Emp. Form.:
C32H33N3O4S2
Mol. Mass.:
587.752
SMILES:
COc1ccc(\C=C\C(=O)NCC(=O)N(C)c2ccc(SC)c(COc3cccc4ccc(C)nc34)c2SC)cc1
: