Target
B2 bradykinin receptor
Ligand
BDBM50074994
Substrate
Meas. Tech.
ChEMBL_216335 (CHEMBL818749)
Ki
5.4±n/a nM
Citation
 Heitsch, HWagner, ASchölkens, BAWirth, K Novel series of O-substituted 8-quinolines and 4-benzothiazoles as potent antagonists of the bradykinin B2 receptors. Bioorg Med Chem Lett 9:327-32 (1999)  
Target
Name:
B2 bradykinin receptor
Synonyms:
B2 bradykinin receptor BDKRB2 BKRB2_CAVPO | Bradykinin B2 receptor
Type:
Mol. Mass.:
42217.03
Organism:
Cavia porcellus
Description:
Residue:
372
  
Inhibitor
Name:
BDBM50074994
Synonyms:
5-[({[4-Methoxy-3-(2-methyl-quinolin-8-yloxymethyl)-2-methylsulfanyl-phenyl]-methyl-carbamoyl}-methyl)-carbamoyl]-pentanoic acid methyl ester | CHEMBL325601
Type:
Small organic molecule
Emp. Form.:
C29H35N3O6S
Mol. Mass.:
553.67
SMILES:
COC(=O)CCCCC(=O)NCC(=O)N(C)c1ccc(OC)c(COc2cccc3ccc(C)nc23)c1SC
: