Target
B2 bradykinin receptor
Ligand
BDBM50074983
Substrate
Meas. Tech.
ChEMBL_216335 (CHEMBL818749)
Ki
1.3±n/a nM
Citation
 Heitsch, HWagner, ASchölkens, BAWirth, K Novel series of O-substituted 8-quinolines and 4-benzothiazoles as potent antagonists of the bradykinin B2 receptors. Bioorg Med Chem Lett 9:327-32 (1999)  
Target
Name:
B2 bradykinin receptor
Synonyms:
B2 bradykinin receptor BDKRB2 BKRB2_CAVPO | Bradykinin B2 receptor
Type:
Mol. Mass.:
42217.03
Organism:
Cavia porcellus
Description:
Residue:
372
  
Inhibitor
Name:
BDBM50074983
Synonyms:
(E)-N-({[2-Chloro-4-methoxy-3-(2-methyl-quinolin-8-yloxymethyl)-phenyl]-methyl-carbamoyl}-methyl)-3-(4-trifluoromethyl-phenyl)-acrylamide | CHEMBL112140
Type:
Small organic molecule
Emp. Form.:
C31H27ClF3N3O4
Mol. Mass.:
598.012
SMILES:
COc1ccc(N(C)C(=O)CNC(=O)\C=C\c2ccc(cc2)C(F)(F)F)c(Cl)c1COc1cccc2ccc(C)nc12
: