Target
B2 bradykinin receptor
Ligand
BDBM50074988
Substrate
Meas. Tech.
ChEMBL_216335 (CHEMBL818749)
Ki
160±n/a nM
Citation
 Heitsch, HWagner, ASchölkens, BAWirth, K Novel series of O-substituted 8-quinolines and 4-benzothiazoles as potent antagonists of the bradykinin B2 receptors. Bioorg Med Chem Lett 9:327-32 (1999)  
Target
Name:
B2 bradykinin receptor
Synonyms:
B2 bradykinin receptor BDKRB2 BKRB2_CAVPO | Bradykinin B2 receptor
Type:
Mol. Mass.:
42217.03
Organism:
Cavia porcellus
Description:
Residue:
372
  
Inhibitor
Name:
BDBM50074988
Synonyms:
(E)-N-({[3-(Benzothiazol-4-yloxymethyl)-2,4-dichloro-phenyl]-methyl-carbamoyl}-methyl)-3-p-tolyl-acrylamide | CHEMBL325624
Type:
Small organic molecule
Emp. Form.:
C27H23Cl2N3O3S
Mol. Mass.:
540.461
SMILES:
CN(C(=O)CNC(=O)\C=C\c1ccc(C)cc1)c1ccc(Cl)c(COc2cccc3scnc23)c1Cl
: