Target
B2 bradykinin receptor
Ligand
BDBM50074992
Substrate
Meas. Tech.
ChEMBL_216335 (CHEMBL818749)
Ki
2.5±n/a nM
Citation
 Heitsch, HWagner, ASchölkens, BAWirth, K Novel series of O-substituted 8-quinolines and 4-benzothiazoles as potent antagonists of the bradykinin B2 receptors. Bioorg Med Chem Lett 9:327-32 (1999)  
Target
Name:
B2 bradykinin receptor
Synonyms:
B2 bradykinin receptor BDKRB2 BKRB2_CAVPO | Bradykinin B2 receptor
Type:
Mol. Mass.:
42217.03
Organism:
Cavia porcellus
Description:
Residue:
372
  
Inhibitor
Name:
BDBM50074992
Synonyms:
(E)-N-({[4-Chloro-2-methoxy-3-(2-methyl-quinolin-8-yloxymethyl)-phenyl]-methyl-carbamoyl}-methyl)-3-(4-trifluoromethyl-phenyl)-acrylamide | CHEMBL113465
Type:
Small organic molecule
Emp. Form.:
C31H27ClF3N3O4
Mol. Mass.:
598.012
SMILES:
COc1c(COc2cccc3ccc(C)nc23)c(Cl)ccc1N(C)C(=O)CNC(=O)\C=C\c1ccc(cc1)C(F)(F)F
: