Target
B2 bradykinin receptor
Ligand
BDBM50074998
Substrate
Meas. Tech.
ChEMBL_216335 (CHEMBL818749)
Ki
3.9±n/a nM
Citation
 Heitsch, HWagner, ASchölkens, BAWirth, K Novel series of O-substituted 8-quinolines and 4-benzothiazoles as potent antagonists of the bradykinin B2 receptors. Bioorg Med Chem Lett 9:327-32 (1999)  
Target
Name:
B2 bradykinin receptor
Synonyms:
B2 bradykinin receptor BDKRB2 BKRB2_CAVPO | Bradykinin B2 receptor
Type:
Mol. Mass.:
42217.03
Organism:
Cavia porcellus
Description:
Residue:
372
  
Inhibitor
Name:
BDBM50074998
Synonyms:
(E)-N-({[4-Methoxy-3-(2-methyl-quinolin-8-yloxymethyl)-2-propoxy-phenyl]-methyl-carbamoyl}-methyl)-3-(4-trifluoromethyl-phenyl)-acrylamide | CHEMBL324575
Type:
Small organic molecule
Emp. Form.:
C34H34F3N3O5
Mol. Mass.:
621.6461
SMILES:
CCCOc1c(COc2cccc3ccc(C)nc23)c(OC)ccc1N(C)C(=O)CNC(=O)\C=C\c1ccc(cc1)C(F)(F)F
: