Target
Insulin receptor
Ligand
BDBM50520589
Substrate
Meas. Tech.
ChEMBL_1881335 (CHEMBL4382834)
IC50
8.0±n/a nM
Citation
 Jang, JSon, JBTo, CBahcall, MKim, SYKang, SYMushajiang, MLee, YJänne, PAChoi, HGGray, NS Discovery of a potent dual ALK and EGFR T790M inhibitor. Eur J Med Chem 136:497-510 (2017)  
Target
Name:
Insulin receptor
Synonyms:
INSR INSR_HUMAN Insulin receptor beta subunit
Type:
Receptor Tyrosine Kinase
Mol. Mass.:
156322.60
Organism:
Homo sapiens (Human)
Description:
P06213
Residue:
1382
  
Inhibitor
Name:
BDBM50520589
Synonyms:
CHEMBL4473365
Type:
Small organic molecule
Emp. Form.:
C28H36ClN7O4S
Mol. Mass.:
602.148
SMILES:
COc1cc(N(C)CCN(C)C)c(NC(=O)C=C)cc1Nc1ncc(Cl)c(Nc2ccccc2S(=O)(=O)C(C)C)n1
: