Target
Chymotrypsin-like elastase family member 2A
Ligand
BDBM50073139
Substrate
Meas. Tech.
ChEBML_158076
IC50
36±n/a nM
Citation
 Iijima, KKatada, JHayashi, Y Symmetrical anhydride-type serine protease inhibitors: structure-activity relationship studies of human chymase inhibitors. Bioorg Med Chem Lett 9:413-8 (1999)  
Target
Name:
Chymotrypsin-like elastase family member 2A
Synonyms:
CEL2A_PIG ELA2 Elastase 2A Elastase-2A | Pancreatic elastase
Type:
PROTEIN
Mol. Mass.:
28705.23
Organism:
Sus scrofa
Description:
ChEMBL_156951
Residue:
269
  
Inhibitor
Name:
BDBM50073139
Synonyms:
2-(4-cyanophenylcarboxamido)-1,1-dimethyl-4-phenylpentanoic anhydride [2,2-dimethyl-3-(N-(4-cyanobenzoyl)aminoi)-5-phenylpentanoic anhydride]
Type:
Small organic molecule
Emp. Form.:
C42H42N4O5
Mol. Mass.:
682.8067
SMILES:
CC(C)(C(CCc1ccccc1)NC(=O)c1ccc(cc1)C#N)C(=O)OC(=O)C(C)(C)C(CCc1ccccc1)NC(=O)c1ccc(cc1)C#N
: