Target
Chymotrypsin-like elastase family member 2A
Ligand
BDBM50075111
Substrate
Meas. Tech.
ChEBML_158076
IC50
180±n/a nM
Citation
 Iijima, KKatada, JHayashi, Y Symmetrical anhydride-type serine protease inhibitors: structure-activity relationship studies of human chymase inhibitors. Bioorg Med Chem Lett 9:413-8 (1999)  
Target
Name:
Chymotrypsin-like elastase family member 2A
Synonyms:
CEL2A_PIG ELA2 Elastase 2A Elastase-2A | Pancreatic elastase
Type:
PROTEIN
Mol. Mass.:
28705.23
Organism:
Sus scrofa
Description:
ChEMBL_156951
Residue:
269
  
Inhibitor
Name:
BDBM50075111
Synonyms:
2-(4-cyanophenylcarboxamido)-2-cyclohex-3-enyl-1,1-dimethylpropanoic anhydride | CHEMBL134024
Type:
Small organic molecule
Emp. Form.:
C38H42N4O5
Mol. Mass.:
634.7639
SMILES:
CC(C)(C(NC(=O)c1ccc(cc1)C#N)C1CCC=CC1)C(=O)OC(=O)C(C)(C)C(NC(=O)c1ccc(cc1)C#N)C1CCC=CC1
: