Target
Chymotrypsinogen B
Ligand
BDBM50075107
Substrate
Meas. Tech.
ChEMBL_216469 (CHEMBL818539)
IC50
12.0±n/a nM
Citation
 Iijima, KKatada, JHayashi, Y Symmetrical anhydride-type serine protease inhibitors: structure-activity relationship studies of human chymase inhibitors. Bioorg Med Chem Lett 9:413-8 (1999)  
Target
Name:
Chymotrypsinogen B
Synonyms:
Beta-chymotrypsin CTRB1 Chymotrypsin B chain A Chymotrypsin B chain C Synonyms=CTRB
Type:
PROTEIN
Mol. Mass.:
27713.98
Organism:
Homo sapiens (Human)
Description:
ChEMBL_10909
Residue:
263
  
Inhibitor
Name:
BDBM50075107
Synonyms:
1,1-dimethyl-4-phenyl-2-propylcarboxamidopentanoic anhydride | CHEMBL436591
Type:
Small organic molecule
Emp. Form.:
C34H48N2O5
Mol. Mass.:
564.7553
SMILES:
CCCC(=O)NC(CCc1ccccc1)C(C)(C)C(=O)OC(=O)C(C)(C)C(CCc1ccccc1)NC(=O)CCC
: