Target
Cathepsin G
Ligand
BDBM50075110
Substrate
Meas. Tech.
ChEBML_45350
IC50
15±n/a nM
Citation
 Iijima, KKatada, JHayashi, Y Symmetrical anhydride-type serine protease inhibitors: structure-activity relationship studies of human chymase inhibitors. Bioorg Med Chem Lett 9:413-8 (1999)  
Target
Name:
Cathepsin G
Synonyms:
CATG_HUMAN CTSG
Type:
PROTEIN
Mol. Mass.:
28860.08
Organism:
Homo sapiens (Human)
Description:
ChEMBL_1469016
Residue:
255
  
Inhibitor
Name:
BDBM50075110
Synonyms:
2-(4-cyanophenylcarboxamido)-1,1-dimethyl-2-phenylpropanoic anhydride | CHEMBL134816
Type:
Small organic molecule
Emp. Form.:
C38H34N4O5
Mol. Mass.:
626.7004
SMILES:
CC(C)(C(NC(=O)c1ccc(cc1)C#N)c1ccccc1)C(=O)OC(=O)C(C)(C)C(NC(=O)c1ccc(cc1)C#N)c1ccccc1
: