Target
Protein farnesyltransferase subunit beta/geranylgeranyltransferase type-1 subunit alpha
Ligand
BDBM50075437
Substrate
Meas. Tech.
ChEBML_69815
IC50
6300±n/a nM
Citation
 Barber, AMHardcastle, IRRowlands, MGNutley, BPMarriott, JHJarman, M Solid-phase synthesis of novel inhibitors of farnesyl transferase. Bioorg Med Chem Lett 9:623-6 (1999)  
Target
Name:
Protein farnesyltransferase subunit beta/geranylgeranyltransferase type-1 subunit alpha
Synonyms:
Protein Farnesyltransferase (PFT)/farnesyltransferase beta subunit | Protein farnesyltransferase
Type:
Mol. Mass.:
Description:
ASSAY_ID of EBI is 69815
Components:
This complex has 2 components.
Component 1
Name:
Protein farnesyltransferase subunit beta
Synonyms:
CAAX farnesyltransferase subunit beta FTase-beta Protein farnesyltransferase Ras proteins prenyltransferase subunit beta
Type:
PROTEIN
Mol. Mass.:
48666.41
Organism:
Rattus norvegicus
Description:
EBI_10573
Residue:
437
  
Component 2
Name:
Protein farnesyltransferase/geranylgeranyltransferase type-1 subunit alpha
Synonyms:
CAAX farnesyltransferase alpha subunit FTase-alpha GGTase-I-alpha Protein farnesyltransferase/geranylgeranyltransferase type I alpha subunit Type I protein geranyl-geranyltransferase alpha subunit | geranylgeranyltransferase type-I
Type:
Enzyme
Mol. Mass.:
44030.14
Organism:
Rattus norvegicus (rat)
Description:
Recombinant rat enzyme.
Residue:
377
  
Inhibitor
Name:
BDBM50075437
Synonyms:
2,4,5-Trifluoro-6-nitro-3-((2E,6E)-3,7,11-trimethyl-dodeca-2,6,10-trienyloxy)-phenol | CHEMBL154890
Type:
Small organic molecule
Emp. Form.:
C21H26F3NO4
Mol. Mass.:
413.4306
SMILES:
[#6]\[#6](-[#6])=[#6]/[#6]-[#6]\[#6](-[#6])=[#6]\[#6]-[#6]\[#6](-[#6])=[#6]\[#6]-[#8]-c1c(F)c(-[#8])c(c(F)c1F)-[#7+](-[#8-])=O
: