Target
Geranylgeranyl transferase type-1 subunit beta/Protein farnesyltransferase/geranylgeranyltransferase type-1 subunit alpha
Ligand
BDBM50075439
Substrate
Meas. Tech.
ChEBML_71977
IC50
58000±n/a nM
Citation
 Barber, AMHardcastle, IRRowlands, MGNutley, BPMarriott, JHJarman, M Solid-phase synthesis of novel inhibitors of farnesyl transferase. Bioorg Med Chem Lett 9:623-6 (1999)  
Target
Name:
Geranylgeranyl transferase type-1 subunit beta/Protein farnesyltransferase/geranylgeranyltransferase type-1 subunit alpha
Synonyms:
Geranylgeranyl transferase type I beta subunit/Protein Farnesyltransferase (PFT)
Type:
Mol. Mass.:
Description:
ASSAY_ID of EBI is 71977
Components:
This complex has 2 components.
Component 1
Name:
Protein farnesyltransferase/geranylgeranyltransferase type-1 subunit alpha
Synonyms:
CAAX farnesyltransferase alpha subunit FTase-alpha GGTase-I-alpha Protein farnesyltransferase/geranylgeranyltransferase type I alpha subunit Type I protein geranyl-geranyltransferase alpha subunit | geranylgeranyltransferase type-I
Type:
Enzyme
Mol. Mass.:
44030.14
Organism:
Rattus norvegicus (rat)
Description:
Recombinant rat enzyme.
Residue:
377
  
Component 2
Name:
Protein farnesyltransferase/geranylgeranyltransferase type-1 subunit alpha
Synonyms:
CAAX farnesyltransferase alpha subunit FTase-alpha GGTase-I-alpha Protein farnesyltransferase/geranylgeranyltransferase type I alpha subunit Type I protein geranyl-geranyltransferase alpha subunit | geranylgeranyltransferase type-I
Type:
Enzyme
Mol. Mass.:
44030.14
Organism:
Rattus norvegicus (rat)
Description:
Recombinant rat enzyme.
Residue:
377
  
Component 3
Name:
Geranylgeranyl transferase type-1 subunit beta
Synonyms:
GGTase-I-beta Geranylgeranyl transferase type-1 subunit beta Pggt1b geranylgeranyltransferase type-I
Type:
PROTEIN
Mol. Mass.:
42414.77
Organism:
Rattus norvegicus
Description:
ChEMBL_105008
Residue:
377
  
Inhibitor
Name:
BDBM50075439
Synonyms:
3-Benzyloxy-2,4,5-trifluoro-6-nitro-phenol | CHEMBL156976
Type:
Small organic molecule
Emp. Form.:
C13H8F3NO4
Mol. Mass.:
299.2021
SMILES:
Oc1c(F)c(OCc2ccccc2)c(F)c(F)c1[N+]([O-])=O
: