Target
Amine oxidase [flavin-containing] B
Ligand
BDBM50046884
Substrate
Meas. Tech.
ChEMBL_1883540 (CHEMBL4385039)
Ki
1145±n/a nM
Citation
 Tzvetkov, NTStammler, HGHristova, SAtanasov, AGAntonov, L (Pyrrolo-pyridin-5-yl)benzamides: BBB permeable monoamine oxidase B inhibitors with neuroprotective effect on cortical neurons. Eur J Med Chem 162:793-809 (2019)  
Target
Name:
Amine oxidase [flavin-containing] B
Synonyms:
AOFB_HUMAN MAOB Monoamine oxidase type B (MAO B) Monoamine oxidase type B (MAOB)
Type:
Protein
Mol. Mass.:
58768.76
Organism:
Homo sapiens (Human)
Description:
P27338
Residue:
520
  
Inhibitor
Name:
BDBM50046884
Synonyms:
CHEMBL3319241
Type:
Small organic molecule
Emp. Form.:
C14H9Cl2N3O
Mol. Mass.:
306.147
SMILES:
Clc1cccc(C(=O)Nc2ccc3[nH]ncc3c2)c1Cl
: